{"text_format":"1","workbook":"xlsx","n_sheets":26,"sheets":["License Agreement","Index","Site Information","Water Balance","Virtual Energy","Treasure Map","Andon","Building Envelope Leaks","Compressed Air","Energy Star Appliances","Fans","Groove Belt","HVAC","LED Lighting","Delamping","Power Strips - Occupancy Sensor","Machine Sleep","Panel Cooler","VFDs","Ice Machines","Water Leaks","Visualizations","Treasure Hunt Form","Conversion Factors","Education Material","E-factors"],"not_rendered":{"charts":9,"images":26,"macros":1,"external_links":0,"defined_names":43,"comments":32,"pivot_tables":0},"unopened":[],"bounds":{"document_bytes":16777216,"sheet_cells":100000,"rows_first":2000,"rows_last":500,"rows_between":2000,"halvings":0,"cell_chars":16384,"cell_head_chars":4096},"cells_cut":0,"cells_raw":0,"read":"whole","date_system":"1900"}

{"sheet":"License Agreement","index":0,"n_rows":107,"n_cols":3,"rows_kept":107,"cut":false,"hidden":false,"merged":[[23,1,23,2],[8,1,8,2],[9,1,9,2],[10,1,10,2],[11,1,11,2],[1,0,1,2],[5,0,5,2],[3,1,3,2],[7,1,7,2],[21,0,21,2],[13,1,13,2],[14,1,14,2],[15,1,15,2],[16,1,16,2],[17,1,17,2],[84,0,84,2],[94,0,94,2],[99,0,99,2],[0,0,0,2],[48,1,48,2],[62,1,62,2],[64,1,64,2],[69,0,69,2],[71,0,71,2],[78,0,78,2],[18,1,18,2],[19,1,19,2],[38,1,38,2],[44,0,44,2],[46,0,46,2],[12,1,12,2]]}
["General Motors Creative Common License Agreement"]
["Attribution-ShareAlike 4.0 International"]
[]
[null,"By exercising the Licensed Rights (defined below), You accept and agree to be bound by the terms and conditions of this Creative Commons Attribution-ShareAlike 4.0 International Public License (\"Public License\"). To the extent this Public License may be interpreted as a contract, You are granted the Licensed Rights in consideration of Your acceptance of these terms and conditions, and the Licensor grants You such rights in consideration of benefits the Licensor receives from making the Licensed Material available under these terms and conditions."]
[]
["Section 1 – Definitions."]
[]
["a.","Adapted Material means material subject to Copyright and Similar Rights that is derived from or based upon the Licensed Material and in which the Licensed Material is translated, altered, arranged, transformed, or otherwise modified in a manner requiring permission under the Copyright and Similar Rights held by the Licensor. For purposes of this Public License, where the Licensed Material is a musical work, performance, or sound recording, Adapted Material is always produced where the Licensed Material is synched in timed relation with a moving image."]
{"$rows_left_out":100}
{"sheet":"Index","index":1,"n_rows":50,"n_cols":12,"rows_kept":50,"cut":false,"hidden":false,"merged":[[49,11,49,14],[1,1,1,6],[2,8,3,8],[5,8,7,8],[2,9,8,13],[11,9,16,13],[18,5,21,6],[22,5,44,6]]}
[]
[null,"Worksheet Index ",null,null,null,null,null,null,"Instructions "]
[null,null,null,null,null,null,null,null,1,"Identify which of the modules are applicable to the specific GM Treasure Maps analysis by selecting \"Applicable\" or \"Not Applicable. This will populate the appropriate tabs for your evaluation. Please note, tabs identified as \"Standard\" will be kept populated at all times. "]
[null,"Site Data ","Applicable/Not Applicable ","Module #",null,"Facility Information "]
[null,"Copyright Licensing Agreement","Standard ","Worksheet",null,"Start Date of Treasure Maps","<Insert Date>"]
[null,"Site Information","Standard ","Worksheet",null,"Organization Name","<Insert Org Name>"]
[null,"Water Balance ","Standard ","Worksheet",null,"Site Name ","<Insert Site Name>"]
[null,"Virtual Energy","Standard ","Worksheet",null,"Site Sector ","<Insert Site Sector>"]
{"$rows_left_out":43}
{"sheet":"Site Information","index":2,"n_rows":31,"n_cols":21,"rows_kept":31,"cut":false,"hidden":false,"merged":[[2,1,2,3],[17,3,17,9],[30,19,30,20],[18,9,21,9],[18,8,21,8],[18,7,21,7],[18,6,21,6],[19,3,21,3]]}
[]
[null,null,null,null,null,null,null,null,null,null,null,null,null,null,null,null,null,null,null,"Scope 2 Factor ","Scope 1 Factor "]
[null,"Site Utility Data ",null,null,null,null,null,null,null,null,null,null,null,null,null,null,null,null,null,{"$f":"_xlfn.XLOOKUP(Index!$G$12,'E-factors'!B8:B73,'E-factors'!J8:J73,'E-factors'!J60)","v":0.45826907375487613},{"$f":"_xlfn.XLOOKUP(Index!$G$12,'E-factors'!B8:B73,'E-factors'!K8:K73,'E-factors'!K60)","v":0.1961076158753793}]
[null,"MonthNumber","Production Units (total units/month)","Production Hours (total hours/month)","Electricity (Mwh)","Electricity (USD) ","Electricity (USD/MWh) ","Natural Gas (Mcf)","Natural Gas (MWh)","Natural Gas  (USD)","Natural Gas (USD/MWh)","Water (M3)","Water (USD)","Water (USD/M3)","CDD (F)","HDD (F)","Intensity - Electricity (MWh)/Unit","Intensity - Natural Gas (MWh)/Unit","Intensity - Water (M3)/Unit","MT CO2e - Electricity","MT CO2e - Natural Gas"]
[null,"2023-01-01",null,null,null,null,{"$f":"IFERROR(E5/F5,0)","v":0},null,{"$f":"IFERROR((H5*0.29),0)","v":0},null,{"$f":"IFERROR(J5/I5,0)","v":0},null,null,{"$f":"IFERROR(M5/L5,0)","v":0},0,0,{"$f":"IFERROR(E5/C5,0)","v":0},{"$f":"IFERROR(I5/C5,0)","v":0},{"$f":"IFERROR(L5/C5,0)","v":0},{"$f":"IFERROR(E5*$T$3,0)","v":0},{"$f":"IFERROR(I5*$U$3,0)","v":0}]
[null,"2023-02-01",null,null,null,null,{"$f":"IFERROR(E6/F6,0)","v":0},null,{"$f":"IFERROR((H6*0.29),0)","v":0},null,{"$f":"IFERROR(J6/I6,0)","v":0},null,null,{"$f":"IFERROR(M6/L6,0)","v":0},0,0,{"$f":"IFERROR(E6/C6,0)","v":0},0,{"$f":"IFERROR(L6/C6,0)","v":0},{"$f":"IFERROR(E6*$T$3,0)","v":0},{"$f":"IFERROR(I6*$U$3,0)","v":0}]
[null,"2023-03-01",null,null,null,null,0,null,0,null,0,null,null,0,0,0,0,0,0,0,0]
[null,"2023-04-01",null,null,null,null,0,null,0,null,0,null,null,0,0,0,0,0,0,0,0]
{"$rows_left_out":24}
{"sheet":"Water Balance","index":3,"n_rows":20,"n_cols":19,"rows_kept":20,"cut":false,"hidden":false,"merged":[[19,16,19,18],[1,2,1,3],[2,3,2,4],[2,5,2,12],[2,13,2,14],[2,15,2,18]]}
[]
[null,null,"Site Water Data"]
[null,null,null,"Supply/Input Water (M3)",null,"Process Water (M3)",null,null,null,null,null,null,null,"Water Reuse (M3)",null,"Balance (M3)"]
[null,"Month","Production Units","City ","Surface & Ground","Sanitation ","Swamp Cooler","Boiler ","Cooling Tower ","WWTP","Humidification ","Fire Protection ","Insert Other","Stormwater ","WWTP","Process Usage ","Water Supply ","Reuse ","Variance"]
[null,{"$f":"'Site Information'!B5","v":"2023-01-01"},{"$f":"'Site Information'!C5","v":0},{"$f":"'Site Information'!M5","v":0},null,null,null,null,null,null,null,null,null,null,null,{"$f":"IFERROR(SUM(F5:M5),\"\")","v":0},{"$f":"SUM(D5:E5)","v":0},{"$f":"SUM(N5:O5)","v":0},{"$f":"IFERROR((Q5-P5)/Q5,\"\")","v":""}]
[null,{"$f":"'Site Information'!B6","v":"2023-02-01"},{"$f":"'Site Information'!C6","v":0},{"$f":"'Site Information'!M6","v":0},null,null,null,null,null,null,null,null,null,null,null,{"$f":"IFERROR(SUM(F6:M6),\"\")","v":0},{"$f":"SUM(D6:E6)","v":0},{"$f":"SUM(N6:O6)","v":0},{"$f":"IFERROR((Q6-P6)/Q6,\"\")","v":""}]
[null,{"$f":"'Site Information'!B7","v":"2023-03-01"},{"$f":"'Site Information'!C7","v":0},{"$f":"'Site Information'!M7","v":0},null,null,null,null,null,null,null,null,null,null,null,0,0,0,""]
[null,{"$f":"'Site Information'!B8","v":"2023-04-01"},{"$f":"'Site Information'!C8","v":0},{"$f":"'Site Information'!M8","v":0},null,null,null,null,null,null,null,null,null,null,null,0,0,0,""]
{"$rows_left_out":13}
{"sheet":"Virtual Energy","index":4,"n_rows":53,"n_cols":20,"rows_kept":53,"cut":false,"hidden":false,"merged":[[2,1,2,6],[20,1,20,6],[36,1,36,6],[52,19,52,24]]}
[]
[null,"Data Analysis "]
[null,"Fuel "]
[null,"Month","CDD or HDD","HDD Value","CDD Value","Production ","Total Fuel (Mwh)"]
[null,"2020-09-19","CDD",{"$f":"IF(C5=\"HDD\",'Site Information'!$P$5,0)","v":0},{"$f":"IF(C5=\"CDD\",'Site Information'!$O$5,0)","v":0},{"$f":"'Site Information'!C5","v":0},{"$f":"'Site Information'!I5","v":0}]
[null,"2020-10-19","HDD",{"$f":"IF(C6=\"HDD\",'Site Information'!$P$6,0)","v":0},{"$f":"IF(C6=\"CDD\",'Site Information'!$O$6,0)","v":0},{"$f":"'Site Information'!C6","v":0},{"$f":"'Site Information'!I6","v":0}]
[null,"2020-11-19","HDD",{"$f":"IF(C7=\"HDD\",'Site Information'!P7,0)","v":0},{"$f":"IF(C7=\"CDD\",'Site Information'!$O$7,0)","v":0},{"$f":"'Site Information'!C7","v":0},{"$f":"'Site Information'!I7","v":0}]
[null,"2020-12-19","HDD",{"$f":"IF(C8=\"HDD\",'Site Information'!$P$8,0)","v":0},{"$f":"IF(C8=\"CDD\",'Site Information'!$O$8,0)","v":0},{"$f":"'Site Information'!C8","v":0},{"$f":"'Site Information'!I8","v":0}]
{"$rows_left_out":46}
{"sheet":"Treasure Map","index":5,"n_rows":34,"n_cols":16,"rows_kept":34,"cut":false,"hidden":false,"merged":[[1,1,2,2],[22,4,22,5],[23,4,23,5],[24,4,24,5],[11,4,11,5],[13,4,13,5],[14,4,14,5],[15,4,15,5],[18,4,18,5],[4,5,5,5],[3,1,3,7],[4,4,5,4],[4,6,5,6],[4,7,5,7],[33,14,33,15],[10,4,10,5],[21,4,21,5],[20,4,20,5],[16,4,16,5],[12,4,12,5],[17,4,17,5],[26,4,26,5],[30,4,30,5],[31,4,31,5],[27,4,27,5],[25,4,25,5],[29,4,29,5],[28,4,28,5],[19,4,19,5]]}
[]
[null,null,null,"Site Name:","Site Sector:"]
[null,null,null,{"$f":"Index!G7","v":"<Insert Site Name>"},{"$f":"Index!G8","v":"<Insert Site Sector>"}]
[null,"Summary & Cost",null,null,null,null,null,null,"Grand Total Cost (USD)","Grand Total Savings (USD)  Per Year","Total Payback Period (Years) ","Grand Total Electricity Savings (Mwh) Per Year","Grand Total Water Savings (M3) Per Year","Grand Total Methane/Propane (Mwh) Per Year","Grand Total Scope 2 Emissions Saved (Mt CO2e) Per Year","Grand Total Scope 1 Emissions Saved (Mt CO2e) Per Year"]
[null,null,"12 Month Total ","Unit ","Cost ","Unit ","Intensity ","Unit ",{"$f":"SUBTOTAL(9,I12:I30)","v":0},{"$f":"SUBTOTAL(9,J12:J30)","v":0},{"$f":"IFERROR(I5/J5,\"\")","v":""},{"$f":"SUBTOTAL(9,L12:L30)","v":0},{"$f":"SUBTOTAL(9,M12:M30)","v":0},{"$f":"SUBTOTAL(9,N12:N30)","v":0},{"$f":"SUBTOTAL(9,O12:O30)","v":0},{"$f":"SUBTOTAL(9,P12:P30)","v":0}]
[null,{"$f":"'Site Information'!D20","v":"Production"},{"$f":"'Site Information'!E20","v":0},{"$f":"'Site Information'!F20","v":"Count/yr"}]
[null,{"$f":"'Site Information'!D23","v":"Electricity "},{"$f":"'Site Information'!E23","v":0},{"$f":"'Site Information'!F23","v":"MWh/yr"},{"$f":"'Site Information'!G23","v":0},{"$f":"'Site Information'!H23","v":"$/Mwh"},{"$f":"'Site Information'!I23","v":0},{"$f":"'Site Information'!J23","v":"Mwh/unit "}]
[null,{"$f":"'Site Information'!D24","v":"Natural Gas "},{"$f":"'Site Information'!E24","v":0},{"$f":"'Site Information'!F24","v":"MWh/yr"},{"$f":"'Site Information'!G24","v":0},{"$f":"'Site Information'!H24","v":"$/Mwh"},{"$f":"'Site Information'!I24","v":0},{"$f":"'Site Information'!J24","v":"Mwh/unit"},null,"`"]
{"$rows_left_out":27}
{"sheet":"Andon","index":6,"n_rows":26,"n_cols":18,"rows_kept":26,"cut":false,"hidden":true,"merged":[[3,1,3,17],[1,1,1,17],[10,1,10,17],[9,1,9,17],[7,1,7,17],[6,2,6,17],[5,2,5,17],[13,3,14,3],[13,4,14,4],[13,5,14,5],[25,15,25,17],[4,2,4,17],[13,6,14,6],[13,7,14,7],[11,1,11,7],[11,9,11,17],[18,4,18,5],[13,1,14,1],[13,2,14,2]]}
[]
[null,"Andon"]
[]
[null,"User Input Instructions"]
[null,"Pink","Please input data ONLY in the pink cells."]
[null,"Gray","Please DO NOT enter any data in the gray cells. They contain formulas"]
[null,"Green","Final outputs for Treasure Map Tab"]
[null,"Please give best estimate if the exact data is not known"]
{"$rows_left_out":19}
{"sheet":"Building Envelope Leaks","index":7,"n_rows":56,"n_cols":22,"rows_kept":56,"cut":false,"hidden":false,"merged":[[8,3,8,21],[12,2,15,21],[9,2,9,21],[1,2,1,21],[3,2,3,21],[4,3,4,21],[5,3,5,21],[6,3,6,21],[7,3,7,21],[42,20,42,21],[17,18,17,19],[18,18,18,19],[40,17,40,18],[23,1,25,1],[21,14,21,15],[21,17,22,17],[21,19,21,20],[21,2,22,2],[21,3,21,5],[21,9,21,10],[21,12,22,12],[21,8,22,8]]}
[]
[null,null,"Building Envelope Leaks"]
[]
[null,null,"User Input Instructions"]
[null,null,"Pink","Please input data ONLY in the pink cells."]
[null,null,"Cold Climate Days","This Section will be used to calculate heating cost impacts"]
[null,null,"Hot Climate Days","This Section will be used to calculate Cooling cost impacts"]
[null,null,"Gray","Please DO NOT enter any data in the gray cells. They contain formulas"]
{"$rows_left_out":49}
{"sheet":"Compressed Air","index":8,"n_rows":35,"n_cols":12,"rows_kept":35,"cut":false,"hidden":false,"merged":[[7,1,7,11],[1,1,1,11],[3,1,3,11],[4,2,4,11],[5,2,5,11],[6,2,6,11],[34,9,34,11],[22,1,22,11],[23,1,23,11],[9,1,9,11],[10,1,10,11]]}
[]
[null,"Compressed Air"]
[]
[null,"User Input Instructions"]
[null,"Pink","Please input data ONLY in the pink cells."]
[null,"Gray","Please DO NOT enter any data in the gray cells. They contain formulas"]
[null,"Green","Final outputs for Treasure Map Tab"]
[null,"Please give best estimate if the exact data is not known"]
{"$rows_left_out":28}
{"sheet":"Energy Star Appliances","index":9,"n_rows":53,"n_cols":11,"rows_kept":53,"cut":false,"hidden":false,"merged":[[52,9,52,10],[35,1,35,4],[35,7,35,10],[44,1,44,10],[45,1,46,10],[21,1,22,10],[23,1,23,4],[23,7,23,10],[32,1,32,10],[33,1,34,10],[20,1,20,10],[1,1,1,10],[3,1,3,10],[9,1,9,10],[10,1,10,10],[7,1,7,10],[5,2,5,10],[4,2,4,10],[11,1,11,4],[6,2,6,10]]}
[]
[null,"Energy Star Appliances"]
[]
[null,"User Input Instructions"]
[null,"Pink","Please input data ONLY in the pink cells."]
[null,"Gray","Please DO NOT enter any data in the gray cells. They contain formulas"]
[null,"Green","Final outputs for Treasure Map Tab"]
[null,"Please give best estimate if the exact data is not known"]
{"$rows_left_out":46}
{"sheet":"Fans","index":10,"n_rows":20,"n_cols":10,"rows_kept":20,"cut":false,"hidden":false,"merged":[[7,1,7,9],[9,1,9,9],[10,1,10,9],[19,8,19,9],[1,1,1,9],[3,1,3,9],[4,2,4,9],[5,2,5,9],[6,2,6,9]]}
[]
[null,"Fans"]
[]
[null,"User Input Instructions"]
[null,"Pink","Please input data ONLY in the pink cells."]
[null,"Gray","Please DO NOT enter any data in the gray cells. They contain formulas"]
[null,"Green","Final outputs for Treasure Map Tab"]
[null,"Please give best estimate if the exact data is not known"]
{"$rows_left_out":13}
{"sheet":"Groove Belt","index":11,"n_rows":40,"n_cols":9,"rows_kept":40,"cut":false,"hidden":false,"merged":[[10,1,17,8],[26,7,26,8],[24,5,24,6],[1,1,1,8],[3,1,3,8],[4,2,4,8],[5,2,5,8],[6,2,6,8],[7,1,7,8],[9,1,9,8]]}
[]
[null,"Groove Belt"]
[null," "," "," "," "," "," "," "," "]
[null,"User Input Instructions"]
[null,"Pink","Please input data ONLY in the pink cells."]
[null,"Gray","Please DO NOT enter any data in the gray cells. They contain formulas"]
[null,"Green","Final outputs for Treasure Map Tab"]
[null,"Please give best estimate if the exact data is not known"]
{"$rows_left_out":33}
{"sheet":"HVAC","index":12,"n_rows":20,"n_cols":11,"rows_kept":20,"cut":false,"hidden":false,"merged":[[1,1,1,10],[3,1,3,10],[4,2,4,10],[5,2,5,10],[6,2,6,10],[7,1,7,10],[19,9,19,10],[9,1,9,10],[10,1,10,10],[11,1,11,10],[12,1,12,10],[17,7,17,8]]}
[]
[null,"HVAC Temperature Setbacks"]
[]
[null,"User Input Instructions"]
[null,"Pink","Please input data ONLY in the pink cells."]
[null,"Gray","Please DO NOT enter any data in the gray cells. They contain formulas"]
[null,"Green","Final outputs for Treasure Map Tab "]
[null,"Please give best estimate if the exact data is not known"]
{"$rows_left_out":13}
{"sheet":"LED Lighting","index":13,"n_rows":37,"n_cols":10,"rows_kept":37,"cut":false,"hidden":false,"merged":[[11,1,11,9],[10,1,10,9],[21,1,21,9],[36,7,36,9],[30,7,30,9],[7,1,7,9],[9,1,9,9],[1,1,1,9],[3,1,3,9],[4,2,4,9],[5,2,5,9],[6,2,6,9]]}
[]
[null,"Lighting LED"]
[]
[null,"User Input Instructions"]
[null,"Pink","Please input data ONLY in the pink cells."]
[null,"Gray","Please DO NOT enter any data in the gray cells. They contain formulas"]
[null,"Green","Final outputs for Treasure Map Tab"]
[null,"Please give best estimate if the exact data is not known"]
{"$rows_left_out":30}
{"sheet":"Delamping","index":14,"n_rows":27,"n_cols":10,"rows_kept":27,"cut":false,"hidden":false,"merged":[[1,1,1,9],[2,1,2,9],[3,1,3,9],[4,2,4,9],[5,2,5,9],[6,2,6,9],[7,1,7,9],[8,1,8,9],[9,1,9,9],[26,7,26,9],[24,6,24,7],[10,1,15,9]]}
[]
[null,"Delamping"]
[]
[null,"User Input Instructions"]
[null,"Pink","Please input data ONLY in the pink cells."]
[null,"Gray","Please DO NOT enter any data in the gray cells. They contain formulas"]
[null,"Green","Final outputs for Treasure Map Tab"]
[null,"Please give best estimate if the exact data is not known"]
{"$rows_left_out":20}
{"sheet":"Power Strips - Occupancy Sensor","index":15,"n_rows":47,"n_cols":11,"rows_kept":47,"cut":false,"hidden":false,"merged":[[9,1,9,10],[10,1,10,10],[46,8,46,10],[31,1,31,2],[12,1,12,2],[29,1,29,10],[28,1,28,10],[7,1,7,10],[1,1,1,10],[3,1,3,10],[4,2,4,10],[5,2,5,10],[6,2,6,10]]}
[]
[null,"Occupancy Sensors"]
[]
[null,"User Input Instructions"]
[null,"Pink","Please input data ONLY in the pink cells."]
[null,"Gray","Please DO NOT enter any data in the gray cells. They contain formulas"]
[null,"Green","Final outputs for Treasure Map Tab"]
[null,"Please give best estimate if the exact data is not known"]
{"$rows_left_out":40}
{"sheet":"Machine Sleep","index":16,"n_rows":19,"n_cols":11,"rows_kept":19,"cut":false,"hidden":false,"merged":[[10,1,10,10],[9,1,9,10],[18,9,18,10],[1,1,1,10],[3,1,3,10],[2,1,2,10],[4,2,4,10],[5,2,5,10],[6,2,6,10],[7,1,7,10],[8,1,8,10]]}
[]
[null,"Machine/Equipment Sleep"]
[]
[null,"User Input Instructions"]
[null,"Pink","Please input data ONLY in the pink cells."]
[null,"Gray","Please DO NOT enter any data in the gray cells. They contain formulas"]
[null,"Green","Final outputs for Treasure Map Tab"]
[null,"Please give best estimate if the exact data is not known"]
{"$rows_left_out":12}
{"sheet":"Panel Cooler","index":17,"n_rows":25,"n_cols":10,"rows_kept":25,"cut":false,"hidden":false,"merged":[[22,6,22,7],[8,1,8,4],[24,7,24,9],[6,2,6,9],[7,1,7,9],[15,1,15,9],[16,1,16,9],[1,1,1,9],[3,1,3,9],[2,1,2,9],[4,2,4,9],[5,2,5,9]]}
[]
[null,"Panel Coolers"]
[]
[null,"User Input Instructions"]
[null,"Pink","Please input data ONLY in the pink cells."]
[null,"Gray","Please DO NOT enter any data in the gray cells. They contain formulas"]
[null,"Green","Final outputs for Treasure Map Tab"]
[null,"Please give best estimate if the exact data is not known"]
{"$rows_left_out":18}
{"sheet":"VFDs","index":18,"n_rows":25,"n_cols":14,"rows_kept":25,"cut":false,"hidden":false,"merged":[[18,11,18,13],[1,1,1,13],[3,1,3,13],[4,2,4,13],[5,2,5,13],[9,1,9,13],[7,1,7,13],[11,6,11,8],[11,9,11,11],[11,12,11,13],[16,10,16,11],[10,1,10,13],[11,1,11,5]]}
[]
[null,"VFDs "]
[]
[null,"User Input Instructions"]
[null,"Pink","Please input data ONLY in the pink cells."]
[null,"Gray","Please DO NOT enter any data in the gray cells. They contain formulas"]
[null,"Green","Final outputs for Treasure Map Tab"]
[null,"Please give best estimate if the exact data is not known"]
{"$rows_left_out":18}
{"sheet":"Ice Machines","index":19,"n_rows":19,"n_cols":12,"rows_kept":19,"cut":false,"hidden":false,"merged":[[16,8,16,12],[18,11,18,12],[1,1,1,12],[9,1,9,12],[7,1,7,12],[10,1,10,12],[6,2,6,12],[5,2,5,12],[4,2,4,12],[3,1,3,12],[11,8,11,12],[12,8,12,12],[13,8,13,12],[14,8,14,12],[15,8,15,12]]}
[]
[null,"Ice Machines: Air vs Water Cooled"]
[]
[null,"User Input Instructions"]
[null,"Pink","Please input data ONLY in the pink cells."]
[null,"Gray","Please DO NOT enter any data in the gray cells. They contain formulas"]
[null,"Green","Final outputs for Treasure Map Tab"]
[null,"Please give best estimate if the exact data is not known"]
{"$rows_left_out":12}
{"sheet":"Water Leaks","index":20,"n_rows":52,"n_cols":10,"rows_kept":52,"cut":false,"hidden":false,"merged":[[51,8,51,9],[49,1,49,3],[1,1,1,9],[4,2,4,9],[5,2,5,9],[7,1,7,9],[9,1,9,9],[10,1,10,9],[6,2,6,9],[3,1,3,9],[8,1,8,9]]}
[]
[null,"Water Leaks"]
[]
[null,"User Input Instructions"]
[null,"Pink","Please input data ONLY in the pink cells."]
[null,"Gray","Please DO NOT enter any data in the gray cells. They contain formulas"]
[null,"Green","Final outputs for Treasure Map Tab"]
[null,"Please give best estimate if the exact data is not known"]
{"$rows_left_out":45}
{"sheet":"Visualizations","index":21,"n_rows":65,"n_cols":19,"rows_kept":65,"cut":false,"hidden":false,"merged":[[45,10,45,11],[44,10,44,11],[49,10,49,11],[48,10,48,11],[47,10,47,11],[46,10,46,11],[54,10,54,11],[53,10,53,11],[52,10,52,11],[51,10,51,11],[50,10,50,11],[59,10,59,11],[58,10,58,11],[57,10,57,11],[56,10,56,11],[55,10,55,11],[64,10,64,11],[63,10,63,11],[62,10,62,11],[61,10,61,11],[60,10,60,11],[8,13,8,15],[2,2,2,4],[16,2,17,2],[25,2,26,4],[16,4,17,4],[2,6,2,7],[4,4,9,4],[2,9,2,10],[4,2,9,2],[45,4,45,5],[43,1,43,9],[45,2,45,3],[46,4,46,5],[45,7,45,8],[29,19,29,21],[18,4,23,4],[18,2,23,2],[27,2,30,4],[12,4,14,4],[12,2,14,2]]}
[]
[]
[null,null,"Savings Dashboard",null,null,null,"Grand Total Electricity Savings (Mwh) Per Year",null,null,"Grand Total Water Savings (M3) Per Year",null,null,"Grand Total Methane/Propane (Mwh) Per Year",null,null,null,"Total Scope 1 Emissions Saved (Mt CO2e) Per Year","Total Scope 2 Emissions Saved (Mt CO2e) Per Year"]
[null,null,"Total Cost",null,"Total Savings",null,"Electricity Savings (MWh)",{"$f":"$C$13","v":0},null,"Water Savings (M3)",{"$f":"$C$19","v":0},null,"Natural Gas Savings (MWh)",{"$f":"$E$13","v":0},null,"Savings (Mt CO2e)",{"$f":"$E$19","v":0},{"$f":"$C$28","v":0}]
[null,null,{"$f":"$K$45","v":0},null,{"$f":"$M$45","v":0},null,"Electricity Usage (MWh)",{"$f":"'Site Information'!$E$23","v":0},null,"Water Usage (M3)",{"$f":"'Site Information'!$E$25","v":0},null,"Natural Gas Usage (MWh)",{"$f":"'Site Information'!$E$24","v":0},null,"Emissions (Mt CO2e)",{"$f":"SUM('Site Information'!U5:U16)/1000000","v":0},{"$f":"SUM('Site Information'!T5:T16)/1000000","v":0}]
[null,null,null,null,null,null,"Usage - Savings",{"$f":"H5-H4","v":0},null,"Usage - Savings",{"$f":"K5-K4","v":0},null,"Usage - Savings",{"$f":"N5-N4","v":0},null,"Usage - Savings",{"$f":"Q5-Q4","v":0},{"$f":"R5-R4","v":0}]
[]
[]
{"$rows_left_out":58}
{"sheet":"Treasure Hunt Form","index":22,"n_rows":83,"n_cols":26,"rows_kept":83,"cut":false,"hidden":false,"merged":[]}
[]
[null,"Energy Star Treasure Hunts"]
[null,"Find the Treasure in Your Facility Campaign"]
[]
[null,"GM wants to empower you to examine your energy use more closely!"]
[null,"Energy Star is a voluntary program of the U.S. Environmental Protection Agency (EPA) that helps businesses and individuals save money and protect our climate through superior energy efficiency. "]
[null,"Energy Treasure Hunts are one best practice that many Energy Star partner organizations have adopted to identify no- and low-cost savings opportunities and build stronger energy teams."]
[null,"The Energy Treasure Map Tool allows organizations to uncover hidden savings through self-guided exercises. Users will also earn Energy Treasure Hunt participation credit."]
{"$rows_left_out":76}
{"sheet":"Conversion Factors","index":23,"n_rows":85,"n_cols":16,"rows_kept":85,"cut":false,"hidden":false,"merged":[[31,1,31,3],[31,5,31,7],[31,9,31,11],[31,13,31,15],[13,1,13,3],[13,5,13,7],[13,9,13,11],[13,13,13,15],[19,1,19,3],[84,13,84,15],[48,1,48,3],[48,5,48,7],[48,9,48,11],[48,13,48,15],[65,5,65,7],[65,9,65,11],[65,13,65,15]]}
[]
["#","Calculation ","Conversion ",null,"#","Abbreviation ","Description "]
[1,"Multiply by 8.314","pounds in a gallon ",null,1,"gpm ","gallons per minute"]
[{"$f":"A3+1","v":2},"Divide by 12","inches to feet",null,{"$f":"E3+1","v":2},"WWTP","wastewater treatment plant"]
[{"$f":"A4+1","v":3},"Multiply by 7.381","cubic feet into gallons ",null,{"$f":"E4+1","v":3},"gph","gallons per hour"]
[4,"Multiply by 0.00378541","gallons to cubic meters",null,4,"mgd","million gallons per day"]
[null,null,null,null,5,"Btu/h","british thermal unit per hour"]
[null,null,null,null,null,"M3 / gal","cubic meters per gallon"]
{"$rows_left_out":78}
{"sheet":"Education Material","index":24,"n_rows":20,"n_cols":4,"rows_kept":20,"cut":false,"hidden":true,"merged":[]}
[]
[null,"#","Topic ","Link to more information "]
[null,1,"Heating & Cooling Degree Day (deg F) ","https://www.weather.gov/key/climate_heat_cool#:~:text=If%20the%20temperature%20mean%20is,result%20is%20Heating%20Degree%20Days.&text=Because%20the%20result%20is%20below,F%20%3D%2036%20Heating%20Degree%20Days."]
[null,2,"Boiler Water Diagram ","https://www.cfm.va.gov/til/sDetail/Div23HVACSteam/SD232111-04.pdf"]
[null,3,"Cooling Tower ","https://www.coolingtowerproducts.com/blog/how-cooling-towers-work-diagram-pictures-2015.htm"]
[null,4,"Textile WWTP ","https://core.ac.uk/download/pdf/35338582.pdf"]
[null,5,"Psychrometric Chart ","http://www.flycarpet.net/en/PsyOnline"]
[null,6,"Steam Table ","https://www.tlv.com/global/US/steam-theory/how-to-read-a-steam-table.html"]
{"$rows_left_out":13}
{"sheet":"E-factors","index":25,"n_rows":73,"n_cols":39,"rows_kept":73,"cut":false,"hidden":false,"merged":[[7,27,7,31],[7,32,7,34],[3,1,3,8],[4,1,6,1],[4,2,4,8],[5,2,5,8],[5,31,5,32],[6,31,6,32]]}
["Emissions Factors"]
[null,"Canada Source",null,"Emission Factors and Reference Values - Canada.ca",null,null,null,null,null,"All Canada S2 converted from g CO2e/kWh",null,null,null,"All Canada S1 converted from g CO2/m3"]
[null,"Source","https://www.epa.gov/egrid/power-profiler#/",null,null,null,null,null,"Created:","2023-01-30",null,null,null,"All US S1 converted from million MT CO2 emissions from natural gas & MMcf natural gas consumption by state"]
[null,"3. State Output Emission Rates (eGRID2021)"]
[null,"State","Total output emission rates"]
[null,null,"(lb/MWh)",null,null,null,null,null,null,"Scope 2 Factor","Scope 1 Factor",null,null,null,null,null,null,null,null,null,null,null,null,null,null,null,"Table 2.  2021 State energy-related carbon dioxide emissions by fuel"]
[null,null,"CO2","CH4","N2O","CO2e","Annual NOX","Ozone Season NOX","SO2","CO2e (MT/MWh)","CO2e (MT/MWh)"]
[null,"AK",920,0.075,0.01,925,6.10,6.20,0.453,{"$f":"F8*(1/2204.6)","v":0.41957724757325593},0.7885403395754025,null,null,null,null,null,null,null,null,null,null,null,null,null,null,null,null,"million metric tons of carbon dioxide",null,null,null,null,"shares"]
{"$rows_left_out":65}